Test_dynamic Error 255

, , Comments Off on Test_dynamic Error 255

TWRP Recovery Error 7 While Installing Any Custom Rom Fix | Easy Guide

RECOMMENDED: If you have Windows errors then we strongly recommend that you download and run this (Windows) Repair Tool.

Error Initializing Provider Ora-12154 Jun 29, 2017. It is throwing error stating "Test Connection failed because of error in initializing provider ORA-12154: TNS : could not resolve the connect. Harddisk Crc Error Fix CRC errors happen when there's a

Apr 22, 2015. Makefile:847: recipe for target 'test_dynamic' failed make: *** [test_dynamic] Error 255 RJRAY/Image-Size-3.300.tar.gz /usr/bin/make test.

View and Download TOTALFLOW XSeries user manual online. XSeries Remote Control pdf manual download.

Error Launching Installer Windows Vista "This operating system is currently not supported by Zune," reads an error message when trying to install Zune software on the latest versions of Microsoft’s own Windows Vista operating system. In an official Zune support

[Archive] Fault codes and vehicle trouble 7 Series – E65 / E66 (2002 – 2008)

May 10, 2016. I have the following error when installing cgpVcf 2.02 (but also with. to 'use' module Sanger::CGP::Vcf make: *** [test_dynamic] Error 255.

Error: Can't load '/Users/7stud/.cpan/build/DBD-mysql-4.022-LOp. make: *** [ test_dynamic] Error 255 CAPTTOFU/DBD-mysql-4.022.tar.gz.

This is a list of notable accidents and incidents involving military aircraft grouped by the year in which the accident or incident occurred. Not all of the aircraft.

Aug 12, 2010. 2/18 subtests failed. make: *** [test_dynamic] Error 255 /usr/bin/make test — NOT OK Running make install make test had returned bad status,

I wrote below code for Dynamic cofiguration. error=error+ "missing required. but while i am trying to test the data in message mapping it will show one error.

A complete list of system error codes, from code 1 through 15841. Too many dynamic-link modules are attached to this program or dynamic. Error Code 255:.

CA-Allocate sort work data set allocation fails with DYNAMIC ALLOCATION. SYSTEM OR INSTALLATION ERROR+ IKJ56231I DYNAMIC ALLOCATION. WITHIN 255 LIMIT.

AUR (en) – perl-wx – Jun 2, 2017. Failed 2/23 test programs. 0/776 subtests failed. Makefile:1277: recipe for target ' test_dynamic' failed make: *** [test_dynamic] Error 255

Statistics: Error (Chpt. 5) Error related to Accuracy Absolute error: difference between the measured value and the true value. Gaussian curves and test

SQL Server Programming FAQ, best practices, interview questions

System Error Codes (0-499) Note. Too many dynamic-link modules are attached to this program or dynamic-link module. 255 (0xFF) The extended.

Harddisk Crc Error Fix CRC errors happen when there's a bad spot on the media of your hard disk. Data recovery and disk repair are often possible with the right tools. Sparkiv Application Error May 25, 2016. This program

RECOMMENDED: Click here to fix Windows errors and improve system performance