Error In Executing The Compilation Process Compilation Failed Exit Code=1

, , Comments Off on Error In Executing The Compilation Process Compilation Failed Exit Code=1

RECOMMENDED: If you have Windows errors then we strongly recommend that you download and run this (Windows) Repair Tool.

Error Creating Bean With Name Transactionmanager Calculo Del Error Estandar De La Muestra Resumen. En la escritura convencional de oraciones y de textos, las palabras están separadas por espacios en blanco. Sin embargo, en los inicios de la. Esto por lo

Donwload the code from git,and run sh compile.sh ,then The error as. Failed to install bazel in Linux. gcc -std=gnu99 failed: error executing command.

Jun 6, 2015. Q6.6: What does "execution of mv failed, exit code 1" mean when I try to. error happened earlier in the build, but the build process didn't stop.

Dec 21, 2014. Before installing the Windows SDK v7.1 (these gave me a bad time):. is going to fail with an obscure " Fatal error during installation " error. Just mount the ISO and run SetupSDKSetup.exe instead of. while compiling my code with the command. I have followed the exact same process still the error

I get these errors. ERROR: Function failed: do_configure (log file is located at. WARNING: exit code 1 from a shell command. | ERROR:.

Describes the most common error levels and exit codes, Indicates that Action has attempted to execute non-recognized command in. The application failed to.

Odbc Connection Error Sql 2005 Some SQL Server Native Client APIs use connection strings to specify connection attributes. Connection strings are lists of keyword and associated values; each. Cannot create an ODBC connection to sql server 2005 standard. SQL Server

Celsus Therapeutics has been on my radar since February 17th when it crashed more than 81% after a failed P2 readout for its lead candidate. To delve into this question, let’s take a look at the below compilation of costs to complete an.

. but if there truly is an error in the compilation process, while executing "exec. by supporting only an 1 byte sized integer as exit code in.

. Error in executing the compilation process. Error in executing the compilation process: Compilation Failed Exit Code=128; Description. In SAP J2EE server,

Error while executing the SSIS package. Open the package in SSIS Designer and resolve the compilation errors. End Error. Process Exit Code 1. The step failed.

Error at Execute process task-SSIS job fails. The process exit code was "1" while the expected was "0". Error while executing win app.

Nov 26, 2014  · . ERROR: oe_runmake failed | WARNING: exit code 1 from a shell command. Error during Kernel Compilation: make:. Error during Kernel Compilation…

Compiler internal error. Process terminated with exit code 3. but it keeps giving me Error:Compiler internal error. Process terminated with exit. Compilation.

Apr 17, 2017. firmware Compile failed. Exiting. Server error make: *** [bin/firmware.bin] Error 1 We just k…. attempting to compile firmware. Compile failed. Exiting. Server error. The same code succeeds after failing 4-5 times in a row. This is our. compile.sh no need to run it with the docker terminal. Not sure if.

I only remember one practical writing lesson from my three years as an English major: Whenever you can, put the best bits at the end of the sentence. Put the next-best bits at the beginning, and put the rest in the middle. This trick works in.

(JSTTSG)(TG)Q2062 – SAP Netweaver Application Server Java. – The_error_is: com.sap.engine. Error in executing the compilation_process: [Compilation_Failed! Exit Code=1. Compilation Failed! Exit Code=1</div>.

I need help with the following error. javax.servlet.ServletException: javax.servlet.ServletException:. compilation process: [ Compilation Failed! Exit Code=1.

Windows System Error Memory Dump Files System error memory dump files,System error minidump files,Temporary Files,Temporary Setup Files,Temporary Sync Files,Thumbnail Cache,Update. On Windows you may receive a similar such dialog, with a button to send the report to Microsoft. This crash report

NBA commissioner Adam Silver revealed Friday that he had a secret Twitter account. A few hours later, one Utah Jazz fan convincingly argued that he had found it. Via ESPN’s Arash Markazi, Silver mentioned that in addition to using the.

. error: linker command failed with exit code 1. 05:48:41: The process "/usr/bin/make" exited with code 2. When executing step "Make" RAW Paste Data

126, Command invoked cannot execute, /dev/null, Permission problem or command. 130, Script terminated by Control-C, Ctl-C, Control-C is fatal error signal 2, (130. According to the above table, exit codes 1 – 2, 126 – 165, and 255 [1] have. since there is no overlap or conflict in usage of exit codes between compiled.

RECOMMENDED: Click here to fix Windows errors and improve system performance