Error Expected Identifier Before Token

, , Comments Off on Error Expected Identifier Before Token

RECOMMENDED: If you have Windows errors then we strongly recommend that you download and run this (Windows) Repair Tool.

You can access the information here or, in the Output window in Visual Studio, you can select an error. expected a valid non-empty string Compiler warning (level 1) C4602 #pragma pop_macro: ‘macro name’ no previous #pragma.

error: expected identifier or ‘(‘ before ‘{‘ token >> net/netfilter/ipvs/ip_vs_proto_tcp.c:737:17: error: ‘tcp_state_name’ undeclared here (not in a function); did you mean ‘tcp_state_idx’? vim +737 net/netfilter/ipvs/ip_vs_proto_tcp.c.

error: expected identifier before '(' token. C / C++ Forums on Bytes.

Simple statements are comprised within a single logical line. Several simple statements may occur on a single line separated by semicolons. The syntax for simple.

Gimpel Software’s PC-lint and FlexeLint On-Line Demos. On-Line Message Reference for FlexeLint and PC-lint (aka FlexeLint for Windows)

May 27, 2011. l08.cpp:52: error: expected unqualified-id before '=' token l08.cpp: At global scope: l08.cpp:60: error: expected identifier before '&' token

(32340711) Syncing 32-bit apps via iTunes now behaves as expected. (32356790. completion handler with either a callback URL containing an authentication token, or with an error. (32433374.

15. Jan. 2014. In file included from katze.cpp:1: katze.h:15: error: expected identifier before '.' token katze.h:15: error: expected unqualified-id before '.' token.

this is prog in C (adjacency.c) that checks if exists in directed graph way from node a to node b # include <stdio.h> # include <stdlib.h> #define N 11 #.

Details of the eWAY Rapid API with Responsive Shared Page, Transparent Redirect, Direct Connection, Token and Recurring Payments

Java Unsupported Class Version Error Unsupported Major Minor Error Failure Human When servers fail or human error compounds and you’re left without the work you. That’s why it’s important to back up your blog now – and regularly – before a. Safety, Accidents,

Visa Inc. – Token Service Technology Tokenization is basically a payment security technology that replaces cardholder information.

Fortran Error 6404 Professional, Affordable Compiler/Editor/Debugger for Windows A little background, if I may: I am porting a legacy Fortran application that is. lbsys.for(59): error #6404: This name does not have a type, and. Error 1 error #6404:
Error Copy File Folder Access Denied Oct 11, 2014. Ever try to delete a file and get an Access is Denied error? Or maybe you're trying to copy or move a file or folder and you get a message stating. Fortran

Thymic positive selection is based on the interactions of T cell antigen receptors (TCRs) with self peptide–major.

error: expected expression before '/' token. 2 " expected identifier or '(' before '. Error: expected ';' before '{' token.

Jun 14, 2012. memmove.c:46:1: error: expected identifier or '(' before '{' token if i try to substitute memmove with another identifier at line 42 (for example xxx).

Simple C program problem. Error: Expected Identifier or. –. Expected Identifier or '(' before '{' token" what does this mean and how can i fix. simple program problem error expected identifier 39 39 39 39.

Hi I've been writing a piece of code as part of university course and I am getting an error and I can't figure out how to fix it. The code is meant to be a reverse.

Qapplication.h:134:36: error: expected identifier before 'void'. This topic has been deleted. Only users with. error: expected ')' before ',' token

RECOMMENDED: Click here to fix Windows errors and improve system performance